{"text_format":"1","workbook":"xlsx","n_sheets":8,"sheets":["Accueil","DGRFM COF","Feuil1","Utilitaire","Validation","détail des projets","indicateurs quantitatifs","Commentaires"],"not_rendered":{"charts":0,"images":14,"macros":1,"external_links":1,"defined_names":1607,"comments":5,"pivot_tables":0},"unopened":[],"bounds":{"document_bytes":16777216,"sheet_cells":100000,"rows_first":2000,"rows_last":500,"rows_between":2000,"halvings":0,"cell_chars":16384,"cell_head_chars":4096},"cells_cut":0,"cells_raw":0,"read":"whole","date_system":"1900"}

{"sheet":"Accueil","index":0,"n_rows":74,"n_cols":13,"rows_kept":74,"cut":false,"hidden":false,"merged":[[58,1,58,2],[58,3,58,11],[18,1,18,3],[24,1,24,13],[16,1,16,13],[17,1,17,13],[19,1,19,13],[20,1,20,13],[57,3,57,11],[54,4,54,13],[25,1,25,13],[73,1,73,2],[73,3,73,4],[54,1,54,2],[56,1,56,2],[56,3,56,11],[57,1,57,2],[55,1,55,2],[67,10,67,11],[72,1,72,3],[72,4,72,8],[72,9,72,11],[65,10,65,11],[62,3,62,4],[62,10,62,11],[66,1,66,2],[65,1,65,2],[66,10,66,11],[66,12,66,13],[62,1,62,2],[66,3,66,4],[66,7,66,8],[65,12,65,13],[65,3,65,4],[65,5,65,6],[65,7,65,8],[66,5,66,6],[72,12,72,13],[67,1,67,2],[67,3,67,4],[67,5,67,6],[67,7,67,8],[67,12,67,13],[1,5,3,10],[4,5,5,10],[55,3,55,11],[12,1,12,7],[52,4,52,13],[51,4,51,13],[53,4,53,13],[51,1,51,2],[52,1,52,2],[53,1,53,2],[15,1,15,13],[21,1,21,13],[22,1,22,13],[23,1,23,13],[14,1,14,13],[26,1,26,13]]}
[]
[null,null,null,null,null,"EXERCICES DE SUIVI DU PACC 2013-2020"]
[]
[]
[null,null,null,null,null,"2018-06-01"]
[]
[]
[]
[]
[null,"Bienvenue dans votre fiche de suivi du Plan d'action 2013-2020 sur les changements climatiques!"]
[]
[]
[null,"Indications spécifiques à l'exercice de juin 2018"]
[null,"Date limite :","2018-06-22"]
[null,"→ Les informations financières doivent être en date du 2018-03-31"]
[null,"→ Veuillez utiliser l'outil de validation sur votre fiche avant de la retourner. Un bouton à cet effet a été ajouté dans les différents onglets."]
[null,"→ Veuillez garder la fiche en format xlsm afin de pouvoir profiter des nouveaux outils conviviaux."]
[null,"→ Besoin d'assistance? Veuillez écrire à l'adresse suivante en spécifiant votre question et vos coordonnées :"]
[null,"direction.executive@cgfv.gouv.qc.ca"]
[null,"→ Avant de débuter l'exercice, veuillez vérifier et compléter au besoin l'information contenue dans la page d'accueil."]
{"$rows_left_out":55}
{"sheet":"DGRFM COF","index":1,"n_rows":45,"n_cols":25,"rows_kept":45,"cut":false,"hidden":false,"merged":[[43,1,43,13],[44,1,44,20],[21,1,22,6],[21,7,22,13],[32,1,32,6],[39,1,39,20],[41,1,41,19],[42,1,42,13],[10,21,10,22],[10,24,10,25],[11,1,11,2],[12,5,12,15],[12,16,12,17],[12,18,12,19],[10,1,10,2],[10,3,10,4],[10,5,10,6],[10,15,10,16],[10,18,10,19],[9,1,9,2],[9,3,9,4],[9,5,9,6],[9,15,9,16],[9,18,9,19],[8,1,8,2],[8,3,8,4],[8,16,8,17],[8,18,8,19],[8,21,8,22],[8,24,8,25],[6,9,6,10],[6,11,6,12],[6,16,6,17],[6,18,6,19],[7,1,7,2],[7,3,7,4],[7,5,7,6],[7,16,7,17],[7,18,7,19],[6,7,6,8],[3,1,3,2],[4,1,4,2],[5,1,5,2],[6,1,6,2],[6,5,6,6]]}
[]
[null,null,null,null,null,null,"Bienvenue dans votre fiche de suivi du PACC 2013-2020!"]
[null,null,null,null,null,null,null,null,null,null,null,null,null,null,null,"Juillet 2018"]
[null,"Priorité :",null,15,"Investir dans l'intermodalité et la logistique pour optimiser le transport des marchandises et des personnes"]
[null,"Action:",null,"15.1","15.1 Programme visant la réduction des émissions de GES par le développement du transport intermodal (PREGTI)"]
[null,"Sous-action:",null,"15.1"]
[null,"Numéro de programme",null,"14983","52141","PSA",null,{"$f":"P7","v":0},null,"Projet"]
[null,"Mise à jour de la fiche le:",null,"2018-07-05"]
[null,"Ministère porteur:",null,"MTMDET"]
[null,"Responsable ministériel:",null,"Lise Roberge",null,null,null,null,null,null,null,null,null,null,null,null,null,"Date de lancement:","2014-02-11"]
[null,"Chargé de projet:",null,"Barbara Pouliot",null,"Budget 2013-2020:",null,null,null,null,null,null,null,null,null,82000000,null,"Date de fin:","2020-03-31"]
[null,"Unité Administrative (UA)",null,1810000,"Unité administrative générique"]
[null,"Personne ressource pour la DGRFM:",null,"Barbara Pouliot"]
[]
[]
[]
[]
[]
[]
[]
{"$rows_left_out":26}
{"sheet":"Feuil1","index":2,"n_rows":0,"n_cols":0,"rows_kept":0,"cut":false,"hidden":true,"merged":[]}

{"sheet":"Utilitaire","index":3,"n_rows":49,"n_cols":11,"rows_kept":49,"cut":false,"hidden":true,"merged":[[15,1,15,5],[15,8,15,9]]}
[]
[]
[null,"Mot de passe:","!1320PACC","Fiche verrouillée:","Oui - diffusion en ligne"]
[null,"Fiche validée:","Oui"]
[null,"GES attendu:","Oui"]
[null,"Feuille accueil complètement remplie:","Non","Exercice de suivi:","2017-12-01"]
[null,"Statut action:",{"$f":"Accueil!D58","v":"en cours"}]
[null,"Feuille Utilitaire visible:","Non","Titre des Onglets:","PLAN D'ACTION 2013-2020 SUR LES CHANGEMENTS CLIMATIQUES"]
[null,"Dernière ligne de la zone de défilement de l'onglet détail des projets:",82]
[null,"nombre d'indicateurs approuvés:","11"]
[null,"Secteur:","PACC 2013-2020"]
[null,"Numéro de séquence de l'action:",15.01]
[]
[]
[null,"Listes Déroulantes"]
[null,"détail des projets",null,null,null,null,"indicateurs quantitatifs","DRFM COF","Accueil"]
[null,"Région Administrative","Statut","Classification","Type d'émissions","Info GES","Type d'indicateur","Exercice de suivi","Statut de l'action","Programmes","Fiche verrouillée"]
[null,"99-toutes les régions","AC-Actif","SU-Subvention","QC-Québec","Oui","minimum à atteindre","2013-2014-1","non démarrée","Non applicable","Oui - partenaire"]
[null,"01-Bas-Saint-Laurent","TE-Terminé","CF-Contrat fonctionnement","HQ-Hors-Québec","Non","maximum à ne pas dépasser","2013-2014-2","en élaboration","Autre programme","Oui - diffusion en ligne"]
[null,"02-Saguenay- Lac-Saint-Jean","AT-En attente","CI-Contrat immobilisation","ND-Non distingué",null,"binaire","2014-2015-1","en cours","Action-Climat Québec ","Non - BGFV"]
{"$rows_left_out":30}
{"sheet":"Validation","index":4,"n_rows":38,"n_cols":6,"rows_kept":38,"cut":false,"hidden":true,"merged":[[2,1,2,3],[4,1,4,3],[3,2,3,5],[5,1,5,5],[1,1,1,4],[4,4,4,5]]}
[]
[null,{"$f":"Utilitaire!E8","v":"PLAN D'ACTION 2013-2020 SUR LES CHANGEMENTS CLIMATIQUES"}]
[null,{"$f":"\"Action \" & Accueil!D58","v":"Action en cours"}]
[null,{"$f":"Accueil!D55","v":"15.1"},{"$f":"Accueil!E55","v":"Programme visant la réduction des émissions de GES par le développement du transport intermodal (PREGTI)"}]
[null,"Ministère porteur:",null,null,{"$f":"Accueil!$D$66","v":"MTMDET"}]
[null,"Rapport de validation de la fiche de suivi"]
[]
[]
["Code de couleur","Feuille concernée","no ligne","Description de la problématique","No d'erreur","Commentaires"]
[null,"détail des projets",25,"Le total des dépenses réelles du projet de la ligne 25 ne correspond pas.",8]
[null,"détail des projets",26,"Des informations caractéristiques du projet de la ligne 26 sont manquantes: RÉGION ADMINISTRATIVE, STATUT, CLASSIFICATION DU PROJET, MONTANT ENGAGÉ ($), DATE DE L'ENGAGEMENT, DATE DU DERNIER VERSEMENT, Budget total du projet ($).",5]
[null,"détail des projets",28,"Des informations caractéristiques du projet de la ligne 28 sont manquantes: RÉGION ADMINISTRATIVE, STATUT, CLASSIFICATION DU PROJET, MONTANT ENGAGÉ ($), DATE DE L'ENGAGEMENT, DATE DU DERNIER VERSEMENT, Budget total du projet ($).",5]
[null,"détail des projets",29,"Des informations caractéristiques du projet de la ligne 29 sont manquantes: DATE DU DERNIER VERSEMENT.",5]
[null,"détail des projets",29,"La dépense du projet de la ligne 29 pour la période 2016-2017 est négative.",6]
[null,"détail des projets",31,"Des informations caractéristiques du projet de la ligne 31 sont manquantes: RÉGION ADMINISTRATIVE, STATUT, CLASSIFICATION DU PROJET, MONTANT ENGAGÉ ($), DATE DE L'ENGAGEMENT, DATE DU DERNIER VERSEMENT, Budget total du projet ($).",5]
[null,"détail des projets",32,"La dépense du projet de la ligne 32 pour la période 2018-2019 est négative.",6]
[null,"détail des projets",33,"Des informations caractéristiques du projet de la ligne 33 sont manquantes: RÉGION ADMINISTRATIVE, STATUT, CLASSIFICATION DU PROJET, MONTANT ENGAGÉ ($), DATE DE L'ENGAGEMENT, DATE DU DERNIER VERSEMENT, Budget total du projet ($).",5]
[null,"détail des projets",40,"La dépense du projet de la ligne 40 pour la période 2018-2019 est négative.",6]
[null,"détail des projets",41,"Des informations caractéristiques du projet de la ligne 41 sont manquantes: RÉGION ADMINISTRATIVE, STATUT, CLASSIFICATION DU PROJET, MONTANT ENGAGÉ ($), DATE DE L'ENGAGEMENT, DATE DU DERNIER VERSEMENT, Budget total du projet ($).",5]
[null,"détail des projets",42,"La dépense du projet de la ligne 42 pour la période 2015-2016 est négative.",6]
{"$rows_left_out":19}
{"sheet":"détail des projets","index":5,"n_rows":71,"n_cols":58,"rows_kept":71,"cut":false,"hidden":false,"merged":[[22,57,23,57],[13,9,13,10],[15,9,15,10],[16,9,16,10],[22,27,23,27],[22,28,23,28],[22,30,22,31],[22,25,23,25],[22,32,22,33],[22,10,23,10],[14,9,14,10],[22,56,23,56],[21,13,21,23],[1,1,1,3],[7,7,7,8],[6,9,6,10],[7,9,7,10],[8,9,8,10],[3,2,3,5],[2,1,2,2],[4,1,4,2],[5,1,5,5],[67,27,67,33],[22,6,23,6],[22,12,23,12],[22,24,23,24],[22,8,23,8],[22,11,23,11],[22,7,23,7],[22,29,23,29],[22,5,23,5],[8,7,8,8],[6,7,6,8],[13,7,13,8],[15,7,15,8],[14,7,14,8],[16,7,16,8],[21,1,21,5],[22,2,23,2],[22,4,23,4],[14,1,14,3],[22,1,23,1],[22,3,23,3]]}
[]
[null,"PLAN D'ACTION 2013-2020 SUR LES CHANGEMENTS CLIMATIQUES"]
[null,{"$f":"\"Action \" & [1]Accueil!D58","v":"Action en cours"}]
[null,{"$f":"[1]Accueil!D55","v":"15.1"},{"$f":"[1]Accueil!E55","v":"Programme visant la réduction des émissions de GES par le développement du transport intermodal (PREGTI)"}]
[null,"Ministère porteur:",null,{"$f":"[1]Accueil!$D$66","v":"MTMDET"}]
[null,"Détails et prévisions des dépenses par projet"]
[]
[]
[]
[]
[]
[]
[]
[]
[]
[]
[]
[]
[]
[null,null,null,null,null,null,null,null,null,null,null,null,null,null,null,null,null,null,null,null,null,null,null,null,null,null,null,null,null,null,null,null,null,null,{"$f":"IF(AND(MID(#REF!,1,9)=AI23,AI24=\"Non Vérifié\"),1,0)","v":{"$error":"#REF!"}},{"$f":"IF(AND(MID(#REF!,1,9)=AJ23,AJ24=\"Non Vérifié\"),1,0)","v":{"$error":"#REF!"}},{"$f":"IF(AND(MID(#REF!,1,9)=AK23,AK24=\"Non Vérifié\"),1,0)","v":{"$error":"#REF!"}},{"$f":"IF(AND(MID(#REF!,1,9)=AL23,AL24=\"Non Vérifié\"),1,0)","v":{"$error":"#REF!"}},{"$f":"IF(AND(MID(#REF!,1,9)=AM23,AM24=\"Non Vérifié\"),1,0)","v":{"$error":"#REF!"}},{"$f":"IF(AND(MID(#REF!,1,9)=AN23,AN24=\"Non Vérifié\"),1,0)","v":{"$error":"#REF!"}},{"$f":"IF(AND(MID(#REF!,1,9)=AO23,AO24=\"Non Vérifié\"),1,0)","v":{"$error":"#REF!"}},{"$f":"IF(AND(MID(#REF!,1,9)=AP23,AP24=\"Non Vérifié\"),1,0)","v":{"$error":"#REF!"}},{"$f":"IF(AND(MID(#REF!,1,9)=AQ23,AQ24=\"Non Vérifié\"),1,0)","v":{"$error":"#REF!"}},{"$f":"IF(AND(MID(#REF!,1,9)=AR23,AR24=\"Non Vérifié\"),1,0)","v":{"$error":"#REF!"}},{"$f":"IF(AND(MID(#REF!,1,9)=AS23,AS24=\"Non Vérifié\"),1,0)","v":{"$error":"#REF!"}},{"$f":"IF(AND(MID(#REF!,1,9)=AT23,AT24=\"Non Vérifié\"),1,0)","v":{"$error":"#REF!"}},{"$f":"IF(AND(MID(#REF!,1,9)=AU23,AU24=\"Non Vérifié\"),1,0)","v":{"$error":"#REF!"}},{"$f":"IF(AND(MID(#REF!,1,9)=AV23,AV24=\"Non Vérifié\"),1,0)","v":{"$error":"#REF!"}},{"$f":"IF(AND(MID(#REF!,1,9)=AW23,AW24=\"Non Vérifié\"),1,0)","v":{"$error":"#REF!"}},{"$f":"IF(AND(MID(#REF!,1,9)=AX23,AX24=\"Non Vérifié\"),1,0)","v":{"$error":"#REF!"}},{"$f":"IF(AND(MID(#REF!,1,9)=AY23,AY24=\"Non Vérifié\"),1,0)","v":{"$error":"#REF!"}},{"$f":"IF(AND(MID(#REF!,1,9)=AZ23,AZ24=\"Non Vérifié\"),1,0)","v":{"$error":"#REF!"}},{"$f":"IF(AND(MID(#REF!,1,9)=BA23,BA24=\"Non Vérifié\"),1,0)","v":{"$error":"#REF!"}},{"$f":"IF(AND(MID(#REF!,1,9)=BB23,BB24=\"Non Vérifié\"),1,0)","v":{"$error":"#REF!"}},{"$f":"IF(AND(MID(#REF!,1,9)=BC23,BC24=\"Non Vérifié\"),1,0)","v":{"$error":"#REF!"}},{"$f":"IF(AND(MID(#REF!,1,9)=BD23,BD24=\"Non Vérifié\"),1,0)","v":{"$error":"#REF!"}}]
{"$rows_left_out":52}
{"sheet":"indicateurs quantitatifs","index":6,"n_rows":45,"n_cols":44,"rows_kept":45,"cut":false,"hidden":false,"merged":[[1,1,1,4],[2,1,2,3],[3,3,3,6],[4,1,4,3],[22,19,23,19],[22,3,23,3],[22,4,23,5],[21,1,21,7],[22,1,23,1],[22,2,23,2],[1,8,5,12],[24,6,24,7],[22,6,23,7],[5,1,5,6],[24,4,24,5],[30,4,30,5],[28,4,28,5],[25,4,25,5],[27,4,27,5],[26,4,26,5],[25,6,25,7],[30,6,30,7],[28,6,28,7],[26,6,26,7],[27,6,27,7],[43,4,43,5],[43,6,43,7],[41,4,41,5],[41,6,41,7],[42,4,42,5],[42,6,42,7],[38,4,38,5],[38,6,38,7],[39,4,39,5],[40,4,40,5],[40,6,40,7],[39,6,39,7],[37,4,37,5],[29,6,29,7],[37,6,37,7],[32,6,32,7],[33,6,33,7],[34,6,34,7],[35,6,35,7],[31,4,31,5],[34,4,34,5],[32,4,32,5],[36,4,36,5],[36,6,36,7],[35,4,35,5],[31,6,31,7],[33,4,33,5],[29,4,29,5]]}
[]
[null,"PLAN D'ACTION 2013-2020 SUR LES CHANGEMENTS CLIMATIQUES",null,null,null,null,null,null,{"$f":"IF(Utilitaire!C10=0,\"Les nouveaux indicateurs inscrits devront être soumis pour approbation au Conseil de gestion du Fonds vert.\",IF(Utilitaire!C10=1,\"Le premier indicateur présenté dans cette page a été convenu au préalable par des annexes 3 ou 4 de l’entente administrative. \n\nLes nouveaux indicateurs inscrits devront être soumis pour approbation au Conseil de gestion du Fonds vert.\",\"Les \"&Utilitaire!C10&\" premiers indicateurs présentés dans cette page ont été convenus au préalable par des annexes 3 ou 4 de l’entente administrative. \n\nLes nouveaux indicateurs inscrits  devront être soumis pour approbation au Conseil de gestion du Fonds vert.\"))","v":"Les 11 premiers indicateurs présentés dans cette page ont été convenus au préalable par des annexes 3 ou 4 de l’entente administrative. \n\nLes nouveaux indicateurs inscrits  devront être soumis pour approbation au Conseil de gestion du Fonds vert."}]
[null,{"$f":"\"Action \" & Accueil!D58","v":"Action en cours"}]
[null,{"$f":"Accueil!D55","v":"15.1"},null,{"$f":"Accueil!E55","v":"Programme visant la réduction des émissions de GES par le développement du transport intermodal (PREGTI)"}]
[null,"Ministère porteur:",null,null,{"$f":"Accueil!$D$66","v":"MTMDET"}]
[null,"Indicateurs quantitatifs"]
[]
[]
[]
[]
[]
[]
[]
[]
[]
[]
[]
[]
[]
[]
{"$rows_left_out":26}
{"sheet":"Commentaires","index":7,"n_rows":33,"n_cols":20,"rows_kept":33,"cut":false,"hidden":false,"merged":[[1,1,1,3],[3,2,3,5],[5,1,5,5],[34,14,34,15],[34,16,34,17],[29,14,29,15],[29,16,29,17],[28,16,28,17],[31,16,31,17],[32,16,32,17],[31,14,31,15],[32,14,32,15],[30,14,30,15],[30,16,30,17],[33,14,33,15],[33,16,33,17],[34,1,34,11],[24,12,24,13],[25,12,25,13],[26,12,26,13],[27,12,27,13],[29,12,29,13],[34,12,34,13],[25,1,25,11],[31,1,31,11],[32,1,32,11],[30,1,30,11],[30,12,30,13],[33,12,33,13],[33,1,33,11],[31,12,31,13],[32,12,32,13],[23,16,23,17],[23,1,23,11],[23,12,23,13],[29,1,29,11],[27,1,27,11],[28,12,28,13],[28,1,28,11],[28,14,28,15],[25,16,25,17],[26,14,26,15],[26,16,26,17],[27,14,27,15],[27,16,27,17],[24,16,24,17],[24,14,24,15],[24,1,24,11],[4,1,4,2],[26,1,26,11],[23,14,23,15],[25,14,25,15],[2,1,2,2]]}
[]
[null,{"$f":"Utilitaire!E8","v":"PLAN D'ACTION 2013-2020 SUR LES CHANGEMENTS CLIMATIQUES"},null,null,null,null,null,null,null,null,null,null,null,null,null,null,null,null,null,"COF"]
[null,{"$f":"\"Action \" & Accueil!D58","v":"Action en cours"},null,null,null,null,null,null,null,null,null,null,null,null,null,null,null,null,null,"frais"]
[null,{"$f":"Accueil!D55","v":"15.1"},{"$f":"Accueil!E55","v":"Programme visant la réduction des émissions de GES par le développement du transport intermodal (PREGTI)"},null,null,null,null,null,null,null,null,null,null,null,null,null,null,null,null,"ETC"]
[null,"Ministère porteur:",null,{"$f":"Accueil!$D$66","v":"MTMDET"},null,null,null,null,null,null,null,null,null,null,null,null,null,null,null,"détail des projets"]
[null,"Commentaires",null,null,null,null,null,null,null,null,null,null,null,null,null,null,null,null,null,"détail des projets (GES)"]
[null,null,null,null,null,null,null,null,null,null,null,null,null,null,null,null,null,null,null,"bilan GES"]
[null,null,null,null,null,null,null,null,null,null,null,null,null,null,null,null,null,null,null,"Indicateurs"]
[null,null,null,null,null,null,null,null,null,null,null,null,null,null,null,null,null,null,null,"Toutes-Autre"]
[]
[]
[null,null,null,null,null,null,null,null,null,null,null,null,null,null,null,null,null,null,null,"2013-2014"]
[null,null,null,null,null,null,null,null,null,null,null,null,null,null,null,null,null,null,null,"2014-2015"]
[null,null,null,null,null,null,null,null,null,null,null,null,null,null,null,null,null,null,null,"2015-2016"]
[null,null,null,null,null,null,null,null,null,null,null,null,null,null,null,null,null,null,null,"2016-2017"]
[null,null,null,null,null,null,null,null,null,null,null,null,null,null,null,null,null,null,null,"2017-2018"]
[]
[]
[]
[]
{"$rows_left_out":13}