{"text_format":"1","workbook":"xlsx","n_sheets":4,"sheets":["Année 2024","Feuil2","Installation","No.Dos.-Adresse"],"not_rendered":{"charts":0,"images":1,"macros":1,"external_links":0,"defined_names":53,"comments":0,"pivot_tables":0},"unopened":[],"bounds":{"document_bytes":16777216,"sheet_cells":100000,"rows_first":2000,"rows_last":500,"rows_between":2000,"halvings":0,"cell_chars":16384,"cell_head_chars":4096},"cells_cut":0,"cells_raw":0,"read":"whole","date_system":"1900"}

{"sheet":"Année 2024","index":0,"n_rows":577,"n_cols":7,"rows_kept":577,"cut":false,"hidden":false,"merged":[[458,1,459,2],[81,1,81,2],[81,3,81,5],[82,1,82,2],[82,3,82,5],[83,1,83,2],[84,1,84,2],[410,1,413,2],[63,1,63,5],[78,1,78,6],[79,6,80,6],[85,1,85,2],[86,1,86,2],[139,4,139,5],[166,4,166,5],[180,4,180,5],[175,4,175,5],[102,4,102,5],[142,4,142,5],[143,4,143,5],[128,4,128,5],[129,4,129,5],[130,4,130,5],[146,4,146,5],[0,3,4,6],[6,1,6,6],[223,1,226,2],[233,1,237,2],[213,1,218,2],[203,1,208,2],[192,1,196,2],[122,1,126,2],[449,1,453,2],[87,1,87,2],[88,1,88,2],[92,1,92,2],[92,3,92,5],[89,1,89,2],[89,3,89,5],[90,1,90,2],[90,3,90,5],[85,3,85,5],[86,3,86,5],[87,3,87,5],[88,3,88,5],[173,4,173,5],[181,3,181,5],[182,4,182,5],[526,1,526,6],[545,1,545,3],[536,1,536,5],[543,1,543,5],[535,4,535,5],[542,3,542,5],[569,1,569,6],[58,1,58,5],[59,1,59,5],[118,4,118,5],[60,1,60,5],[529,1,529,4],[206,4,206,5],[201,4,201,5],[198,4,198,5],[203,4,203,5],[204,4,204,5],[97,1,97,6],[62,1,62,5],[79,1,79,5],[75,1,75,5],[76,1,76,5],[80,1,80,2],[80,3,80,5],[144,4,144,5],[147,4,147,5],[148,4,148,5],[149,4,149,5],[150,4,150,5],[145,4,145,5],[113,4,113,5],[111,4,111,5],[115,4,115,5],[135,4,135,5],[119,4,119,5],[420,4,420,5],[107,4,107,5],[172,1,172,2],[137,4,137,5],[134,4,134,5],[117,4,117,5],[131,4,131,5],[120,4,120,5],[121,3,121,5],[133,4,133,5],[122,4,122,5],[123,4,123,5],[132,4,132,5],[164,4,164,5],[159,3,159,5],[167,4,167,5],[142,1,144,2],[141,3,141,5],[136,4,136,5],[138,4,138,5],[124,4,124,5],[125,4,125,5],[126,4,126,5],[127,4,127,5],[332,4,332,5],[152,4,152,5],[546,6,547,6],[553,1,553,6],[269,4,269,5],[372,4,372,5],[370,3,370,5],[550,1,550,6],[335,4,335,5],[334,1,334,2],[337,1,337,2],[338,4,338,5],[328,4,328,5],[325,1,325,2],[336,4,336,5],[329,4,329,5],[324,4,324,5],[339,1,339,2],[336,1,336,2],[339,4,339,5],[325,4,325,5],[276,4,276,5],[321,4,321,5],[322,3,322,5],[170,4,170,5],[401,1,401,2],[314,1,316,2],[317,1,317,2],[341,1,341,2],[371,4,371,5],[367,4,367,5],[323,1,323,2],[342,1,342,2],[342,4,342,5],[357,1,357,2],[354,4,354,5],[353,4,353,5],[368,4,368,5],[357,4,357,5],[351,4,351,5],[343,1,343,2],[344,3,344,5],[343,4,343,5],[315,4,315,5],[327,4,327,5],[318,1,318,2],[318,4,318,5],[319,4,319,5],[163,4,163,5],[161,4,161,5],[162,4,162,5],[168,4,168,5],[420,1,427,2],[103,4,103,5],[104,4,104,5],[105,4,105,5],[106,4,106,5],[112,4,112,5],[140,4,140,5],[341,4,341,5],[301,4,301,5],[302,4,302,5],[303,4,303,5],[304,3,304,5],[313,3,313,5],[331,4,331,5],[294,3,294,5],[291,4,291,5],[305,4,305,5],[330,4,330,5],[316,4,316,5],[317,4,317,5],[240,4,240,5],[185,4,185,5],[189,4,189,5],[186,4,186,5],[222,3,222,5],[216,4,216,5],[215,4,215,5],[221,4,221,5],[197,4,197,5],[220,4,220,5],[213,4,213,5],[190,4,190,5],[191,3,191,5],[209,4,209,5],[207,4,207,5],[205,4,205,5],[202,3,202,5],[210,4,210,5],[217,4,217,5],[239,4,239,5],[228,4,228,5],[229,4,229,5],[223,4,223,5],[224,4,224,5],[225,4,225,5],[233,4,233,5],[226,4,226,5],[227,4,227,5],[184,4,184,5],[212,3,212,5],[208,4,208,5],[200,4,200,5],[235,4,235,5],[214,4,214,5],[195,4,195,5],[196,4,196,5],[7,1,7,6],[20,1,20,6],[19,1,19,6],[174,4,174,5],[187,4,187,5],[183,4,183,5],[176,4,176,5],[199,4,199,5],[22,1,22,4],[22,5,22,6],[36,1,36,4],[21,5,21,6],[53,1,53,5],[8,1,8,6],[18,1,18,6],[13,1,13,3],[14,1,14,3],[155,4,155,5],[153,4,153,5],[154,4,154,5],[151,4,151,5],[169,4,169,5],[160,4,160,5],[12,1,12,3],[242,3,242,5],[177,4,177,5],[279,4,279,5],[292,4,292,5],[192,4,192,5],[238,4,238,5],[275,4,275,5],[273,3,273,5],[178,4,178,5],[230,4,230,5],[261,4,261,5],[218,4,218,5],[219,4,219,5],[211,4,211,5],[281,4,281,5],[254,4,254,5],[277,4,277,5],[278,4,278,5],[236,4,236,5],[237,4,237,5],[231,4,231,5],[232,3,232,5],[193,4,193,5],[188,4,188,5],[13,4,13,5],[14,4,14,5],[54,1,54,5],[52,1,52,5],[24,1,24,4],[40,5,40,6],[34,1,34,6],[30,1,30,6],[32,1,32,6],[24,5,24,6],[28,1,28,3],[28,4,28,5],[42,1,42,6],[43,1,44,6],[46,1,46,6],[47,1,47,6],[38,5,38,6],[40,1,40,4],[51,1,51,6],[38,1,38,4],[430,1,433,2],[418,4,418,5],[55,1,55,5],[172,4,172,5],[171,3,171,5],[179,4,179,5],[156,4,156,5],[158,4,158,5],[157,4,157,5],[165,4,165,5],[100,1,101,2],[98,1,99,2],[99,3,99,5],[110,4,110,5],[100,4,100,5],[114,4,114,5],[116,4,116,5],[84,3,84,5],[108,4,108,5],[98,3,98,5],[101,4,101,5],[109,4,109,5],[93,1,93,5],[194,4,194,5],[462,4,462,5],[463,4,463,5],[474,4,474,5],[464,4,464,5],[465,4,465,5],[466,4,466,5],[467,3,467,5],[445,4,445,5],[448,3,448,5],[472,4,472,5],[470,4,470,5],[471,4,471,5],[571,1,571,3],[571,4,571,6],[563,2,563,6],[564,2,564,5],[521,4,521,5],[518,1,518,2],[518,4,518,5],[557,2,557,6],[523,3,523,5],[539,1,539,4],[528,1,528,4],[530,1,530,4],[522,4,522,5],[556,2,556,6],[541,1,541,4],[538,1,538,4],[524,3,524,5],[540,1,540,4],[520,4,520,5],[519,1,519,2],[546,1,546,5],[522,1,522,2],[521,1,521,2],[561,1,561,4],[347,1,347,6],[422,4,422,5],[516,4,516,5],[513,3,513,5],[516,1,516,2],[515,1,515,2],[499,4,499,5],[514,4,514,5],[500,4,500,5],[497,4,497,5],[501,4,501,5],[512,4,512,5],[509,4,509,5],[510,4,510,5],[511,4,511,5],[506,4,506,5],[507,4,507,5],[508,4,508,5],[502,4,502,5],[494,1,500,2],[504,1,508,2],[505,4,505,5],[442,4,442,5],[443,4,443,5],[475,1,475,2],[473,1,473,2],[476,4,476,5],[471,1,471,2],[470,1,470,2],[478,3,478,5],[488,4,488,5],[493,3,493,5],[491,4,491,5],[481,3,481,5],[483,1,484,2],[487,4,487,5],[486,4,486,5],[498,4,498,5],[496,4,496,5],[474,1,474,2],[475,4,475,5],[477,3,477,5],[476,1,476,2],[293,4,293,5],[326,4,326,5],[267,4,267,5],[424,4,424,5],[421,4,421,5],[431,4,431,5],[426,4,426,5],[468,4,468,5],[427,4,427,5],[433,4,433,5],[430,4,430,5],[432,4,432,5],[458,4,458,5],[459,4,459,5],[460,4,460,5],[456,4,456,5],[457,3,457,5],[434,4,434,5],[285,4,285,5],[286,4,286,5],[287,4,287,5],[289,4,289,5],[247,4,247,5],[323,4,323,5],[264,4,264,5],[266,4,266,5],[250,4,250,5],[284,4,284,5],[288,4,288,5],[311,4,311,5],[312,4,312,5],[320,4,320,5],[274,4,274,5],[251,4,251,5],[314,4,314,5],[272,4,272,5],[290,4,290,5],[444,4,444,5],[438,4,438,5],[435,4,435,5],[441,4,441,5],[439,3,439,5],[454,4,454,5],[436,4,436,5],[447,4,447,5],[446,4,446,5],[274,1,278,2],[259,4,259,5],[335,1,335,2],[337,4,337,5],[338,1,338,2],[340,1,340,2],[340,4,340,5],[333,3,333,5],[334,4,334,5],[284,1,286,2],[298,1,298,2],[305,1,310,2],[306,4,306,5],[295,1,297,2],[295,4,295,5],[296,4,296,5],[297,4,297,5],[298,4,298,5],[299,4,299,5],[300,4,300,5],[307,4,307,5],[308,4,308,5],[309,4,309,5],[310,4,310,5],[266,1,269,2],[252,3,252,5],[262,4,262,5],[263,3,263,5],[243,4,243,5],[256,4,256,5],[265,4,265,5],[268,4,268,5],[253,4,253,5],[246,4,246,5],[264,1,265,2],[255,4,255,5],[245,4,245,5],[391,1,391,2],[358,4,358,5],[364,1,364,2],[375,4,375,5],[379,3,379,5],[364,4,364,5],[361,4,361,5],[356,3,356,5],[350,1,353,2],[371,1,373,2],[355,4,355,5],[383,4,383,5],[389,4,389,5],[405,1,405,6],[393,1,393,2],[360,4,360,5],[393,4,393,5],[468,1,468,2],[469,4,469,5],[472,1,472,2],[473,4,473,5],[485,4,485,5],[481,1,482,2],[483,4,483,5],[484,4,484,5],[482,3,482,5],[480,1,480,6],[469,1,469,2],[415,4,415,5],[440,4,440,5],[453,4,453,5],[440,1,445,2],[455,4,455,5],[425,4,425,5],[417,4,417,5],[399,4,399,5],[396,4,396,5],[392,4,392,5],[400,4,400,5],[359,4,359,5],[397,3,397,5],[386,4,386,5],[387,4,387,5],[388,4,388,5],[374,4,374,5],[382,4,382,5],[378,4,378,5],[394,4,394,5],[380,4,380,5],[369,4,369,5],[381,4,381,5],[391,4,391,5],[363,3,363,5],[413,4,413,5],[402,3,402,5],[519,4,519,5],[503,3,503,5],[520,1,520,2],[83,3,83,5],[408,1,409,2],[345,3,345,5],[384,4,384,5],[390,3,390,5],[398,4,398,5],[411,4,411,5],[429,3,429,5],[423,4,423,5],[419,3,419,5],[412,4,412,5],[410,4,410,5],[408,3,408,5],[400,1,400,2],[366,4,366,5],[362,4,362,5],[365,4,365,5],[253,1,254,2],[403,3,403,5],[575,1,575,4],[234,4,234,5],[280,4,280,5],[283,3,283,5],[257,4,257,5],[258,4,258,5],[271,4,271,5],[241,4,241,5],[401,4,401,5],[395,4,395,5],[533,1,533,4],[398,1,398,2],[399,1,399,2],[461,4,461,5],[428,4,428,5],[437,4,437,5],[414,4,414,5],[449,4,449,5],[450,4,450,5],[451,4,451,5],[452,4,452,5],[407,1,407,6],[416,4,416,5],[409,3,409,5],[534,1,534,4],[56,1,56,5],[69,1,69,5],[70,1,70,5],[71,1,71,5],[72,1,72,5],[73,1,73,5],[57,1,57,5],[65,1,65,6],[66,1,66,5],[67,1,67,5],[68,1,68,5],[514,1,514,2],[517,4,517,5],[515,4,515,5],[517,1,517,2],[531,1,531,4],[532,1,532,4],[504,4,504,5],[495,4,495,5],[494,4,494,5],[492,4,492,5],[489,4,489,5],[490,4,490,5],[61,1,61,5],[74,1,74,5],[91,1,91,2],[91,3,91,5],[385,4,385,5],[376,4,376,5],[377,4,377,5],[380,1,385,2],[160,1,161,2],[182,1,183,2],[373,4,373,5],[348,1,349,2],[348,3,348,5],[349,3,349,5],[352,4,352,5],[350,4,350,5],[244,4,244,5],[248,4,248,5],[260,4,260,5],[282,4,282,5],[243,1,245,2],[270,4,270,5],[249,4,249,5],[255,1,258,2]]}
[null,null,null,"FORMULAIRE DE DÉCLARATION ANNUELLE 2024"]
[]
[]
[]
[]
[]
[null,"Avant le 31 mars de chaque année, les exploitants visés par le Règlement sur les redevances exigibles pour l'élimation de matières résiduelles et par les articles 39 et 52 du Règlement sur l'enfouissement et l'incinérateur de matières résiduelles doivent indiquer au Ministère, dans le formulaire de déclaration annuelle fourni à cet effet, la provenance, la nature et le poids des matières résiduelles qui ont été éliminées durant l’année. Ce document doit être certifié par un membre de l’Ordre des comptables professionnels agréés du Québec.\n\nLes données issues du formulaire de déclaration annuelle permettent notamment de déterminer les redevances à verser pour l'année visée, ainsi que les données d’élimination des municipalités du Québec. Ces données sont utilisées pour déterminer les subventions octroyées dans le cadre du Programme sur la redistribution aux municipalités des redevances pour l’élimination de matières résiduelles. \n\nSi aucune matière résiduelle n’a été reçue pendant un trimestre ou une année donnée, l’exploitant est tout de même tenu de remplir et de transmettre les formulaires exigés par le Règlement, et ce, tant que l’autorisation ministérielle relative à son installation d’élimination est en vigueur. "]
[null,"Afin de remplir adéquatement le formulaire de déclaration annuelle 2024, nous vous invitons à consulter le guide préparé à cet effet à l'adresse suivante :"]
[null,"https://www.environnement.gouv.qc.ca/matieres/redevances/Guide-rapp-annuel.pdf"]
[]
[null,"1. Renseignements généraux"]
[]
[null,"Type d'installation (liste déroulante) :",null,null,null,{"$f":"IF($E$13=\"LEET\",\"Veuillez remplir la section 1.5\",\" \")","v":" "}]
[null,"Nom de l'installation (liste déroulante) :"]
[null,"No de dossier (saisie automatique) :                                ",null,null,{"$f":"IF($E$14<>\"\",VLOOKUP($E$14,Installation!D3:E124,2,FALSE),\"\")","v":""}]
[]
[null,"1.1 Identification de l'exploitant :"]
[null,"Nom :"]
[]
[null,"Adresse :"]
[]
[null,"Municipalité ou ville :",null,null,null,"Code postal :"]
[]
[null,"Région administrative (saisie automatique) :",null,null,null,"MRC (saisie automatique) :"]
[null,{"$f":"IF($E$15<>\"\",VLOOKUP($E$15,Installation!E3:F124,2,FALSE),\"\")","v":""},null,null,null,{"$f":"IF($E$15<>\"\",VLOOKUP($E$15,Installation!E3:G124,3,FALSE),\"\")","v":""}]
[]
[null,"1.2 Identification du répondant :"]
[null,"Prénom et nom :",null,null,"Fonction ou titre :",null,"Téléphone :"]
[]
[null,"Adresse courriel :"]
{"$rows_left_out":548}
{"sheet":"Feuil2","index":1,"n_rows":1285,"n_cols":3,"rows_kept":1285,"cut":false,"hidden":true,"merged":[]}
[99999,"(Autre - à spécifier)","M"]
[1023,"Les Îles-de-la-Madeleine (M)","M"]
[1042,"Grosse-Île (M)","V"]
[2005,"Percé (V)","M"]
[2010,"Sainte-Thérèse-de-Gaspé (M)","V"]
[2015,"Grande-Rivière (V)","V"]
[2028,"Chandler (V)","M"]
[2047,"Port-Daniel–Gascons (M)","NO"]
[2902,"Mont-Alexandre (NO)","V"]
[3005,"Gaspé (V)","CT"]
[3010,"Cloridorme (CT)","M"]
[3015,"Petite-Vallée (M)","M"]
[3020,"Grande-Vallée (M)","V"]
[3025,"Murdochville (V)","NO"]
[3902,"Rivière-Saint-Jean (NO)","NO"]
[3904,"Collines-du-Basque (NO)","M"]
[4005,"Sainte-Madeleine-de-la-Rivière-Madeleine (M)","M"]
[4010,"Saint-Maxime-du-Mont-Louis (M)","VL"]
[4015,"Mont-Saint-Pierre (VL)","M"]
[4020,"Rivière-à-Claude (M)","VL"]
[4025,"Marsoui (VL)","M"]
[4030,"La Martre (M)","V"]
[4037,"Sainte-Anne-des-Monts (V)","V"]
[4047,"Cap-Chat (V)","NO"]
[4902,"Mont-Albert (NO)","NO"]
[4904,"Coulée-des-Adolphe (NO)","M"]
[5010,"Shigawake (M)","CT"]
[5015,"Saint-Godefroi (CT)","M"]
[5020,"Hope Town (M)","CT"]
[5025,"Hope (CT)","V"]
{"$rows_left_out":1256}
{"sheet":"Installation","index":2,"n_rows":124,"n_cols":9,"rows_kept":124,"cut":false,"hidden":true,"merged":[]}
[]
["Type d'installation",null,"Type","Installation","Numéro de dossier de l'exploitant","Région","MRC"]
["Centre de transfert",null,"Centre de transfert","Centre de transfert d'Amqui (Fusion environnement inc.)","3912-01-070-220","01 - Bas-Saint-Laurent","La Matapédia"]
["Centre de transfert de faible capacité",null,"Centre de transfert","Centre de transfert de Mont-Joli (RITMR des MRC de La Matapédia et de la Mitis)","3912-01-090-143","01 - Bas-Saint-Laurent","La Mitis"]
["Incinérateur",null,"Centre de transfert","Centre de transfert de Roberval (RGMR du Lac-Saint-Jean)","3912-02-910-157","02 - Saguenay-Lac-Saint-Jean","Domaine-du-Roy"]
["LEET",null,"Centre de transfert","Centre de transfert de Dolbeau-Mistassini (RGMR du Lac-Saint-Jean)","3912-02-920-158","02 - Saguenay-Lac-Saint-Jean","Maria-Chapdelaine"]
["LEDCD",null,"Centre de transfert","Centre de transfert de Saguenay (GFL Environnement/Matrec)","3912-02-999-147","02 - Saguenay-Lac-Saint-Jean","Hors MRC"]
["LET",null,"Centre de transfert","Centre de transfert de Québec (GFL Environnement/Matrec)","3912-03-210-137","03 - Capitale-Nationale","La Côte-de-Beaupré"]
[null,null,"Centre de transfert","Centre de transfert de Bury (Valoris/Régie intermunicipale du Haut-Saint-François et de Sherbrooke)","3912-05-360-200","05 - Estrie","Hors MRC"]
["Régions administratives",null,"Centre de transfert","Centre de transfert des Entreprises Raylobec inc. (Sherbrooke)","3912-05-430-219","05 - Estrie","Hors MRC"]
["01 - Bas-Saint-Laurent",null,"Centre de transfert","Centre de Recyclage Notre-Dame inc./EBI (Anjou)","3912-06-660-140","06 - Montréal","Hors MRC"]
["02 - Saguenay-Lac-Saint-Jean",null,"Centre de transfert","Centre de transfert d'Anjou (WM Québec Inc.)","3912-06-660-222","06 - Montréal","Hors MRC"]
["03 - Capitale-Nationale",null,"Centre de transfert","Centre de transfert de Chénéville (Épursol)","3912-07-800-217","07 - Outaouais","Papineau"]
["04 - Mauricie",null,"Centre de transfert","Centre de transfert de la Ville de Gatineau","3912-07-810-160","07 - Outaouais","Hors MRC"]
["05 - Estrie",null,"Centre de transfert","Centre de transfert de Gatineau (GFL Environnement/Matrec)","3912-07-810-208","07 - Outaouais","Hors MRC"]
["06 - Montréal",null,"Centre de transfert","Centre de transfert de LGL Globe/Enviro Connexions (Gatineau)","3912-07-810-218","07 - Outaouais","Hors MRC"]
["07 - Outaouais",null,"Centre de transfert","Centre de transfert de la MRC des Collines-de-l'Outaouais","3912-07-820-154","07 - Outaouais","Collines-de-l'Outaouais"]
["08 - Abitibi-Témiscamingue",null,"Centre de transfert","Centre de transfert de McGrimmon Cartage (Clarendon/MRC Pontiac)","3912-07-820-221","07 - Outaouais","Collines-de-l'Outaouais"]
["09 - Côte-Nord",null,"Centre de transfert","Centre de transfert Fillogreen – Pontiac (Litchfield)","3912-07-840-225","07 - Outaouais","Pontiac",null,"Nouvelle inscription (fonctionnel depuis août 2024)"]
["10 - Nord-du-Québec",null,"Centre de transfert","Centre de transfert de la MRC de la Vallée-de-la-Gatineau","3912-07-830-172","07 - Outaouais","La Vallée-de-la-Gatineau"]
["11 - Gaspésie-Îles-de-la-Madeleine",null,"Centre de transfert","Centre de transfert de la MRC d'Abitibi-Ouest","3912-08-870-152","08 - Abitibi-Témiscamingue","Abitibi-Ouest"]
["12 - Chaudière-Appalaches",null,"Centre de transfert","Centre de transfert d'Exploitation Jaffa inc. (Saint-Alphonse) - Inactif","3912-11-040-206","11 - Gaspésie-Îles-de-la-Madeleine","La Haute-Gaspésie"]
["13 - Laval",null,"Centre de transfert","Centre de transfert de L'Islet (Énercycle)","3912-12-170-144","12 - Chaudière-Appalaches","L'Islet"]
["14 - Lanaudière",null,"Centre de transfert","Centre de transfert de Saint-Georges (Services sanitaires DF de Beauce inc.)","3912-12-290-216","12 - Chaudière-Appalaches","Beauce-Sartigan"]
["15 - Laurentides",null,"Centre de transfert","Centre de transfert de Thetford Mines (Services sanitaires Denis Fortier inc.)","3912-12-310-145","12 - Chaudière-Appalaches","Appalaches"]
["16 - Montérégie",null,"Centre de transfert","Centre de transfert de Laval (WM Québec inc.)","3912-13-650-156","13 - Laval","Hors MRC"]
["17 - Centre-du-Québec",null,"Centre de transfert","Centre de transfert de Saint-Hyacinthe (GFL Environnement/Matrec)","3912-16-540-136","16 - Montérégie","Maskoutains"]
[null,null,"Centre de transfert","Centre de transfert de JMV Environnement inc. (Saint-Hyacinthe)","3912-16-540-214","16 - Montérégie","Maskoutains"]
[null,null,"Centre de transfert","Centre de transfert de Beloeil (Services environnementaux du Richelieu)","3912-16-570-142","16 - Montérégie","La Vallée-du-Richelieu"]
[null,null,"Centre de transfert","Centre de transfert Fibres J.C. inc. (Chambly)","3912-16-570-202","16 - Montérégie","La Vallée-du-Richelieu"]
{"$rows_left_out":95}
{"sheet":"No.Dos.-Adresse","index":3,"n_rows":120,"n_cols":11,"rows_kept":120,"cut":false,"hidden":true,"merged":[]}
["Type","Numéro dossier","Colonne1","Nom","Exploitant","Adresse ","Municipalité","Code postal","MRC"]
["CT","3912-01-070-220","01 - Bas-Saint-Laurent","Centre de transfert d'Amqui (Fusion environnement inc.)","Fusion environnement inc.","15, rang Saint-Édouard","Amqui","G5J 3N8","La Matapédia"]
["LET","3912-01-080-001","01 - Bas-Saint-Laurent","LET de Matane","Ville de Matane","230, avenue Saint-Jérôme","Matane","G4W 3A2","La Matanie"]
["CT","3912-01-090-143","01 - Bas-Saint-Laurent","Centre de transfert de Mont-Joli (RITMR des MRC de La Matapédia et de la Mitis)","RITMR des MRC de la Matapédia et de La Mitis","300, avenue Sanatorium","Mont-Joli","G5H 1V7","La Mitis"]
["LET","3912-01-100-005","01 - Bas-Saint-Laurent","LET de Rimouski","Ville de Rimouski","205, avenue de la Cathédrale, C. P. 710","Rimouski","G5L 7C7","Rimouski-Neigette"]
["LET","3912-01-120-006","01 - Bas-Saint-Laurent","LET de Rivière-du-Loup","Ville de Rivière-du-Loup","65, rue L'Hôtel-de-Ville, C. P. 37","Rivière-du-Loup","G5R 3Y7","Rivière-du-Loup"]
["LET","3912-01-130-007","01 - Bas-Saint-Laurent","LET de Dégelis (RIDT)","Régie intermunicipale des déchets de Témiscouata","369, avenue Principale","Dégelis","G5T 2G3","Témiscouata"]
["LEDCD","3912-02-910-012","02 - Saguenay-Lac-Saint-Jean","LEDCD Les Entreprises Jean Tremblay et Fils inc (Saint-Félicien)","Entreprises Jean Tremblay et Fils inc.","1227, Rang Simple Nord","Saint-Félicien","G8K 2N8","Domaine-du-Roy"]
["CT","3912-02-910-157","02 - Saguenay-Lac-Saint-Jean","Centre de transfert de Roberval (RGMR du Lac-Saint-Jean)","Régie de gestion des matières résiduelles du Lac-Saint-Jean","625, rue Bergeron Ouest","Alma","G8B 1V3","Domaine-du-Roy"]
["LEDCD","3912-02-920-014","02 - Saguenay-Lac-Saint-Jean","LEDCD d'Excavation Dolbeau inc.","Excavation Dolbeau inc.","493, 2e Avenue","Dolbeau-Mistassini","G8L 1V3","Maria-Chapdelaine",null,"01 - Bas-Saint-Laurent"]
["CT","3912-02-920-158","02 - Saguenay-Lac-Saint-Jean","Centre de transfert de Dolbeau-Mistassini (RGMR du Lac-Saint-Jean)","Régie de gestion des matières résiduelles du Lac-Saint-Jean","625, rue Bergeron Ouest\r\nAlma (Québec)","Alma","G8B 1V3","Maria-Chapdelaine",null,"02 - Saguenay-Lac-Saint-Jean"]
["LET","3912-02-930-201","02 - Saguenay-Lac-Saint-Jean","LET d'Hébertville-Station","Régie de gestion des matières résiduelles du Lac-Saint-Jean","625, rue Bergeron Ouest","Alma","G8B 1V3","Lac-Saint-Jean-Est",null,"03 - Capitale-Nationale"]
["CT","3912-02-999-147","02 - Saguenay-Lac-Saint-Jean","Centre de transfert de Saguenay (GFL Environnement/Matrec)","GFL Environmental inc.","3199, boul. Talbot","Ville Saguenay","G7B 5B1","Hors MRC",null,"04 - Mauricie"]
["LET","3912-03-150-026","03 - Capitale-Nationale","LET de la MRC de Charlevoix-Est","Municipalité régionale de comté de Charlevoix-Est","172, boul. Notre-Dame","Clermont","G4A 1G1","Charlevoix-Est",null,"05 - Estrie"]
["CT Faible","3912-03-160-161","03 - Capitale-Nationale","Centre de transfert de la MRC de Charlevoix (Faible capacité)","Municipalité régionale de comté de Charlevoix","4, Place de l'Église, local 201","Baie-Saint-Paul","G3Z 1T2","Charlevoix",null,"06 - Montréal"]
["CT","3912-03-210-137","03 - Capitale-Nationale","Centre de transfert de Québec (GFL Environnement/Matrec)","GFL environmental inc.","4, chemin du Tremblay","Boucherville","J4B 6Z5","La Côte-de-Beaupré",null,"07 - Outaouais"]
["LET","3912-03-340-031","03 - Capitale-Nationale","LET de Neuville (RRGMR de Portneuf)","Régie régionale de gestion des matières résiduelles de Portneuf","1300, chemin du Site","Neuville","G0A 2R0","Portneuf",null,"08 - Abitibi-Témiscamingue"]
["LET","3912-03-999-028","03 - Capitale-Nationale","LET de la Ville de Québec (Saint-Joachim)","Ville de Québec","1210, boulevard Montmorency","Québec","G1J 3V9","Hors MRC",null,"09 - Côte-Nord"]
["INC","3912-03-999-035","03 - Capitale-Nationale","Incinérateur de la Ville de Québec","Ville de Québec","1210, boulevard Montmorency","Québec","G1J 3V9","Hors MRC",null,"10 - Nord-du-Québec"]
["LEDCD","3912-04-371-038","04 - Mauricie","LEDCD de Sable des Forges inc.","Sable des Forges inc.","11450, boulevard Industriel","Trois-Rivières","G9A 5E1","Hors MRC",null,"11 - Gaspésie-Îles-de-la-Madeleine"]
["LET","3912-04-372-040","04 - Mauricie","LET Champlain (GFL Environnement/Matrec)","Régie de gestion des matières résiduelles de la Mauricie","295, route Ste-Marie","Champlain","G0X 1C0","Chenaux",null,"12 - Chaudière-Appalaches"]
["LET","3912-04-510-041","04 - Mauricie","LET de Saint-Étienne-des-Grès (RGMR de la Mauricie)","Régie de gestion des matières résiduelles de la Mauricie","400, boul. de la Gabelle","Saint-Étienne-des-Grès","G0X 2P0","Maskinongé",null,"13 - Laval"]
["CT Faible","3912-04-999-149","04 - Mauricie","Centre de transfert de la ville de La Tuque (Faible capacité)","Ville de La Tuque","375, rue Saint-Joseph","La Tuque","G9X 1L7","Hors MRC",null,"14 - Lanaudière"]
["LEET","3912-04-999-184","04 - Mauricie","LEET du secteur de la baie Jean-Pierre ","Ville de la Tuque","375 rue Saint-Joseph","La Tuque","G9X 1L5","Hors MRC",null,"15 - Laurentides"]
["LEET","3912-04-999-185","04 - Mauricie","LEET du secteur Lac Châteauvert","Ville de la Tuque","375 rue Saint-Joseph","La Tuque","G9X 1L5","Hors MRC",null,"16 - Montérégie"]
["LEET","3912-04-999-186","04 - Mauricie","LEET de La Tuque, canton Bardy (Flamand)","Ville de la Tuque","375 rue Saint-Joseph","La Tuque","G9X 1L5","Hors MRC",null,"17 - Centre-du-Québec"]
["LEET","3912-04-999-187","04 - Mauricie","LEET de La Tuque, secteur Parent (Lamy)","Ville de la Tuque","375 rue Saint-Joseph","La Tuque","G9X 1L5","Hors MRC"]
["LEET","3912-04-999-188","04 - Mauricie","LEET de La Tuque, relais 22","Ville de la Tuque","375 rue Saint-Joseph","La Tuque","G9X 1L5","Hors MRC"]
["LEET","3912-04-999-189","04 - Mauricie","LEET de Wemotaci","Conseil des Atikamekw de Wemotaci","36 rue Kenosi","Wemotaci","G0X 3P5","Hors MRC"]
["LEET","3912-04-999-209","04 - Mauricie","LEET d'Opitciwan","Conseil des Atikamekw d’Opitciwan","22, rue Ami","Obedjiwan","G0W 3B0","Hors MRC"]
{"$rows_left_out":90}