{"text_format":"1","workbook":"xlsx","n_sheets":11,"sheets":["Instructions","Identification","Saisie des données","Utilisation du sol","Types d'aménagement","Classes d'aménagement","Dégradation du rivage","Classes de dégradation","Options","Log","4GIS"],"not_rendered":{"charts":8,"images":6,"macros":1,"external_links":0,"defined_names":8,"comments":3,"pivot_tables":0},"unopened":[],"bounds":{"document_bytes":16777216,"sheet_cells":100000,"rows_first":2000,"rows_last":500,"rows_between":2000,"halvings":0,"cell_chars":16384,"cell_head_chars":4096},"cells_cut":0,"cells_raw":0,"read":"whole","date_system":"1900"}

{"sheet":"Instructions","index":0,"n_rows":25,"n_cols":4,"rows_kept":25,"cut":false,"hidden":false,"merged":[[21,2,23,7],[24,2,24,7],[1,3,1,6],[2,3,2,6],[3,3,3,6],[6,2,13,7]]}
[]
[null,null,null,"Caractérisation de la bande riveraine"]
[null,null,null,"Outil de compilation des données et de présentation des résultats"]
[null,null,null,"Guide d'utilisation"]
[]
[]
[null,null,"Le guide d'utilisation est disponible en format Adobe Reader. Double cliquez sur l'icône ci-dessous pour ouvrir le document et, s'il y a lieu, l'imprimer. Le document ne s'ouvrira que si vous avez l'application d'installée sur votre ordinateur. Au besoin, vous pouvez la télécharger en cliquant sur l'icône «Get ADOBE® READER». Vous devez bien sûr avoir un accès à Internet."]
[]
{"$rows_left_out":18}
{"sheet":"Identification","index":1,"n_rows":60,"n_cols":5,"rows_kept":60,"cut":false,"hidden":false,"merged":[[2,0,2,255],[3,0,3,255],[4,0,4,255],[7,2,7,5],[11,2,11,5],[26,2,26,5],[28,2,28,5],[27,2,27,5],[12,2,12,5],[13,2,13,5],[15,2,15,5],[14,2,14,5],[20,2,20,5],[25,2,25,5],[23,2,23,5],[24,2,24,5],[22,2,22,5],[21,2,21,5],[19,2,19,5],[16,2,16,5],[17,2,17,5],[42,2,42,5],[35,2,35,5],[37,2,37,5],[62,3,62,5],[48,2,48,5],[43,2,43,5],[44,2,44,5],[45,2,45,5],[46,2,46,5],[61,3,61,5],[38,2,38,5],[40,2,40,5],[41,2,41,5],[63,3,63,5],[64,3,64,5],[30,2,30,5],[29,2,29,5],[74,3,74,5],[66,3,66,5],[67,3,67,5],[65,3,65,5],[68,3,68,5],[56,2,56,5],[47,2,47,5],[54,2,54,5],[55,2,55,5],[49,2,49,5],[50,2,50,5],[51,2,51,5],[18,2,18,5],[39,2,39,5],[79,3,79,5],[71,3,71,5],[69,3,69,5],[70,3,70,5],[52,2,52,5],[53,2,53,5],[77,3,77,5],[78,3,78,5],[75,3,75,5],[76,3,76,5],[59,3,59,5],[60,3,60,5],[72,3,72,5],[73,3,73,5]]}
[]
[]
["Caractérisation de la bande riveraine"]
["Outil de compilation des données et de présentation des résultats"]
["Identification"]
[]
[]
[null,"Nom du lac:"]
{"$rows_left_out":53}
{"sheet":"Saisie des données","index":2,"n_rows":237,"n_cols":24,"rows_kept":237,"cut":false,"hidden":true,"merged":[[1,2,1,5],[6,20,7,20],[6,3,6,4],[3,0,3,1],[6,15,6,17],[6,18,6,19],[6,5,6,7],[6,8,6,9]]}
[]
[null,{"$f":"IF(Identification!F10<>\"\",Identification!F10,\"\")","v":""},{"$f":"Identification!C8","v":0},null,null,null,{"$f":"IF(Identification!C10<>\"9999\",\"RSVL \" &Identification!C10,\"\")","v":"RSVL "}]
[]
["Secteur:",null,"Un seul"]
[]
[]
[null,null,null,"Coordonnées (NAD83)",null,"Types d'aménagement (%)",null,null,"Dégradation rive (%)",null,null,null,null,null,null,"Types d'aménagement (m)",null,null,"Dégradation rive (m)",null,"Distance linéaire avec zone suivante (m)"]
["# Zone homogène","Catégorie d'utilisation","Longueur de la zone (m)","Latitude","Longitude","Végétation naturelle","Végétation ornementale","Matériaux inertes","Sol dénudé et érosion","Muret et remblais","Observateur","Date","Commentaires","Photos",null,"Végétation naturelle","Végétation ornementale","Matériaux inertes","Sol dénudé et érosion","Muret et remblais",null,"% Non dégradé","Choix de cat. d'utilisation","Choix d'observateurs"]
{"$rows_left_out":230}
{"sheet":"Utilisation du sol","index":3,"n_rows":18,"n_cols":5,"rows_kept":18,"cut":false,"hidden":true,"merged":[[0,0,0,5],[1,0,1,5]]}
[{"$f":"\"Tableau 1. \" & Options!C9","v":"Tableau 1. Répartition de l'utilisation du sol dans la bande riveraine"}]
[{"$f":"Options!C10","v":""}]
[]
["Catégories d'utilisation",null,"Nombre de zones homogènes","Surface de bande riveraine (m²)","Importance relative (%)"]
["Zones"]
[{"$f":"Options!C2","v":"Naturelle"},null,{"$f":"COUNTIF('Saisie des données'!$B$9:$B$208,'Saisie des données'!W9)","v":0},{"$f":"SUMIF('Saisie des données'!$B$9:$B$208,'Saisie des données'!W9,'Saisie des données'!$C$9:$C$208)*Options!C70","v":0},{"$f":"IF($D$12>0,D6/$D$12,0)","v":0}]
[{"$f":"Options!C3","v":"Habitée"},null,{"$f":"COUNTIF('Saisie des données'!$B$9:$B$208,'Saisie des données'!W10)","v":0},{"$f":"SUMIF('Saisie des données'!$B$9:$B$208,'Saisie des données'!W10,'Saisie des données'!$C$9:$C$208)*Options!C70","v":0},{"$f":"IF($D$12>0,D7/$D$12,0)","v":0}]
[{"$f":"Options!C4","v":"Infrastructures"},null,{"$f":"COUNTIF('Saisie des données'!$B$9:$B$208,'Saisie des données'!W11)","v":0},{"$f":"SUMIF('Saisie des données'!$B$9:$B$208,'Saisie des données'!W11,'Saisie des données'!$C$9:$C$208)*Options!C70","v":0},{"$f":"IF($D$12>0,D8/$D$12,0)","v":0}]
{"$rows_left_out":11}
{"sheet":"Types d'aménagement","index":4,"n_rows":11,"n_cols":19,"rows_kept":11,"cut":false,"hidden":true,"merged":[[0,0,0,19],[1,0,1,19],[4,10,4,12],[4,13,4,15],[3,1,3,19],[3,0,4,0],[4,1,4,3],[4,16,4,19],[4,4,4,6],[4,7,4,9]]}
[{"$f":"\"Tableau 2. \" & Options!C21","v":"Tableau 2. Importance des types d'aménagement dans la bande riveraine"}]
[{"$f":"Options!C22","v":""}]
[]
["Type d'aménagement","Catégories d'utilisation du sol (surface de bande riveraine en m² / en %)"]
[null,{"$f":"Options!C2","v":"Naturelle"},null,null,{"$f":"Options!C3","v":"Habitée"},null,null,{"$f":"Options!C4","v":"Infrastructures"},null,null,{"$f":"Options!C5","v":"Agriculture"},null,null,{"$f":"Options!C6","v":"Foresterie"},null,null,{"$f":"Options!C7","v":"Total"}]
[]
[{"$f":"Options!C17","v":"Végétation naturelle"},{"$f":"SUMPRODUCT(('Saisie des données'!$B$9:$B$208=B$5)*('Saisie des données'!$P$9:$P$208))*Options!C70","v":0},"/",{"$f":"IF($Q$11>0,B7/$Q$11,0)","v":0},{"$f":"SUMPRODUCT(('Saisie des données'!$B$9:$B$208=E$5)*('Saisie des données'!$P$9:$P$208))*Options!C70","v":0},"/",{"$f":"IF($Q$11>0,E7/$Q$11,0)","v":0},{"$f":"SUMPRODUCT(('Saisie des données'!$B$9:$B$208=H$5)*('Saisie des données'!$P$9:$P$208))*Options!C70","v":0},"/",{"$f":"IF($Q$11>0,H7/$Q$11,0)","v":0},{"$f":"SUMPRODUCT(('Saisie des données'!$B$9:$B$208=K$5)*('Saisie des données'!$P$9:$P$208))*Options!C70","v":0},"/",{"$f":"IF($Q$11>0,K7/$Q$11,0)","v":0},{"$f":"SUMPRODUCT(('Saisie des données'!$B$9:$B$208=N$5)*('Saisie des données'!$P$9:$P$208))*Options!C70","v":0},"/",{"$f":"IF($Q$11>0,N7/$Q$11,0)","v":0},{"$f":"B7+E7+H7+K7+N7","v":0},"/",{"$f":"D7+G7+J7+M7+P7","v":0}]
[{"$f":"Options!C18","v":"Végétation ornementale"},{"$f":"SUMPRODUCT(('Saisie des données'!$B$9:$B$208=B$5)*('Saisie des données'!$Q$9:$Q$208))*Options!C70","v":0},"/",{"$f":"IF($Q$11>0,B8/$Q$11,0)","v":0},{"$f":"SUMPRODUCT(('Saisie des données'!$B$9:$B$208=E$5)*('Saisie des données'!$Q$9:$Q$208))*Options!C70","v":0},"/",{"$f":"IF($Q$11>0,E8/$Q$11,0)","v":0},{"$f":"SUMPRODUCT(('Saisie des données'!$B$9:$B$208=H$5)*('Saisie des données'!$Q$9:$Q$208))*Options!C70","v":0},"/",{"$f":"IF($Q$11>0,H8/$Q$11,0)","v":0},{"$f":"SUMPRODUCT(('Saisie des données'!$B$9:$B$208=K$5)*('Saisie des données'!$Q$9:$Q$208))*Options!C70","v":0},"/",{"$f":"IF($Q$11>0,K8/$Q$11,0)","v":0},{"$f":"SUMPRODUCT(('Saisie des données'!$B$9:$B$208=N$5)*('Saisie des données'!$Q$9:$Q$208))*Options!C70","v":0},"/",{"$f":"IF($Q$11>0,N8/$Q$11,0)","v":0},{"$f":"B8+E8+H8+K8+N8","v":0},"/",{"$f":"D8+G8+J8+M8+P8","v":0}]
{"$rows_left_out":4}
{"sheet":"Classes d'aménagement","index":5,"n_rows":13,"n_cols":19,"rows_kept":13,"cut":false,"hidden":true,"merged":[[0,0,0,19],[1,0,1,19],[3,1,3,19],[4,7,4,9],[4,10,4,12],[4,13,4,15],[4,16,4,19],[3,0,4,0],[4,1,4,3],[4,4,4,6]]}
[{"$f":"\"Tableau 3. \" & Options!C28","v":"Tableau 3. Importance des classes d'aménagement dans la bande riveraine"}]
[{"$f":"Options!C29","v":""}]
[]
["Classe","Catégories d'utilisation du sol (surface de bande riveraine en m² / en %)"]
[null,{"$f":"Options!C2","v":"Naturelle"},null,null,{"$f":"Options!C3","v":"Habitée"},null,null,{"$f":"Options!C4","v":"Infrastructures"},null,null,{"$f":"Options!C5","v":"Agriculture"},null,null,{"$f":"Options!C6","v":"Foresterie"},null,null,{"$f":"Options!C7","v":"Total"}]
[]
[{"$f":"Options!C31","v":"A (80% et plus en végétation naturelle)"},{"$f":"SUMPRODUCT(('Saisie des données'!$B$9:$B$208=B$5)*('Saisie des données'!$F$9:$F$208>=80)*('Saisie des données'!$C$9:$C$208))*Options!C70","v":0},"/",{"$f":"IF($Q$13>0,B7/$Q$13,0)","v":0},{"$f":"SUMPRODUCT(('Saisie des données'!$B$9:$B$208=E$5)*('Saisie des données'!$F$9:$F$208>=80)*('Saisie des données'!$C$9:$C$208))*Options!C70","v":0},"/",{"$f":"IF($Q$13>0,E7/$Q$13,0)","v":0},{"$f":"SUMPRODUCT(('Saisie des données'!$B$9:$B$208=H$5)*('Saisie des données'!$F$9:$F$208>=80)*('Saisie des données'!$C$9:$C$208))*Options!C70","v":0},"/",{"$f":"IF($Q$13>0,H7/$Q$13,0)","v":0},{"$f":"SUMPRODUCT(('Saisie des données'!$B$9:$B$208=K$5)*('Saisie des données'!$F$9:$F$208>=80)*('Saisie des données'!$C$9:$C$208))*Options!C70","v":0},"/",{"$f":"IF($Q$13>0,K7/$Q$13,0)","v":0},{"$f":"SUMPRODUCT(('Saisie des données'!$B$9:$B$208=N$5)*('Saisie des données'!$F$9:$F$208>=80)*('Saisie des données'!$C$9:$C$208))*Options!C70","v":0},"/",{"$f":"IF($Q$13>0,N7/$Q$13,0)","v":0},{"$f":"B7+E7+H7+K7+N7","v":0},"/",{"$f":"D7+G7+J7+M7+P7","v":0}]
[{"$f":"Options!C32","v":"B (60% à <80% en végétation naturelle)"},{"$f":"SUMPRODUCT(('Saisie des données'!$B$9:$B$208=B$5)*('Saisie des données'!$F$9:$F$208>=60)*('Saisie des données'!$F$9:$F$208<80)*('Saisie des données'!$C$9:$C$208))*Options!C70","v":0},"/",{"$f":"IF($Q$13>0,B8/$Q$13,0)","v":0},{"$f":"SUMPRODUCT(('Saisie des données'!$B$9:$B$208=E$5)*('Saisie des données'!$F$9:$F$208>=60)*('Saisie des données'!$F$9:$F$208<80)*('Saisie des données'!$C$9:$C$208))*Options!C70","v":0},"/",{"$f":"IF($Q$13>0,E8/$Q$13,0)","v":0},{"$f":"SUMPRODUCT(('Saisie des données'!$B$9:$B$208=H$5)*('Saisie des données'!$F$9:$F$208>=60)*('Saisie des données'!$F$9:$F$208<80)*('Saisie des données'!$C$9:$C$208))*Options!C70","v":0},"/",{"$f":"IF($Q$13>0,H8/$Q$13,0)","v":0},{"$f":"SUMPRODUCT(('Saisie des données'!$B$9:$B$208=K$5)*('Saisie des données'!$F$9:$F$208>=60)*('Saisie des données'!$F$9:$F$208<80)*('Saisie des données'!$C$9:$C$208))*Options!C70","v":0},"/",{"$f":"IF($Q$13>0,K8/$Q$13,0)","v":0},{"$f":"SUMPRODUCT(('Saisie des données'!$B$9:$B$208=N$5)*('Saisie des données'!$F$9:$F$208>=60)*('Saisie des données'!$F$9:$F$208<80)*('Saisie des données'!$C$9:$C$208))*Options!C70","v":0},"/",{"$f":"IF($Q$13>0,N8/$Q$13,0)","v":0},{"$f":"B8+E8+H8+K8+N8","v":0},"/",{"$f":"D8+G8+J8+M8+P8","v":0}]
{"$rows_left_out":6}
{"sheet":"Dégradation du rivage","index":6,"n_rows":11,"n_cols":19,"rows_kept":11,"cut":false,"hidden":true,"merged":[[3,0,4,0],[4,1,4,3],[4,4,4,6],[0,0,0,19],[1,0,1,19],[3,1,3,19],[4,7,4,9],[4,10,4,12],[4,13,4,15],[4,16,4,19]]}
[{"$f":"\"Tableau 4. \" & Options!C43","v":"Tableau 4. Importance des signes de dégradation du rivage"}]
[{"$f":"Options!C44","v":""}]
[]
["Descripteurs de dégradation","Catégories d'utilisation du sol (longueur de rivage en m / en %)"]
[null,{"$f":"Options!C2","v":"Naturelle"},null,null,{"$f":"Options!C3","v":"Habitée"},null,null,{"$f":"Options!C4","v":"Infrastructures"},null,null,{"$f":"Options!C5","v":"Agriculture"},null,null,{"$f":"Options!C6","v":"Foresterie"},null,null,{"$f":"Options!C7","v":"Total"}]
[]
[{"$f":"Options!C46","v":"Murets et remblais"},{"$f":"SUMPRODUCT(('Saisie des données'!$B$9:$B$208=B$5)*('Saisie des données'!$T$9:$T$208))","v":0},"/",{"$f":"IF($Q$11>0,B7/$Q$11,0)","v":0},{"$f":"SUMPRODUCT(('Saisie des données'!$B$9:$B$208=E$5)*('Saisie des données'!$T$9:$T$208))","v":0},"/",{"$f":"IF($Q$11>0,E7/$Q$11,0)","v":0},{"$f":"SUMPRODUCT(('Saisie des données'!$B$9:$B$208=H$5)*('Saisie des données'!$T$9:$T$208))","v":0},"/",{"$f":"IF($Q$11>0,H7/$Q$11,0)","v":0},{"$f":"SUMPRODUCT(('Saisie des données'!$B$9:$B$208=K$5)*('Saisie des données'!$T$9:$T$208))","v":0},"/",{"$f":"IF($Q$11>0,K7/$Q$11,0)","v":0},{"$f":"SUMPRODUCT(('Saisie des données'!$B$9:$B$208=N$5)*('Saisie des données'!$T$9:$T$208))","v":0},"/",{"$f":"IF($Q$11>0,N7/$Q$11,0)","v":0},{"$f":"B7+E7+H7+K7+N7","v":0},"/",{"$f":"D7+G7+J7+M7+P7","v":0}]
[{"$f":"Options!C47","v":"Sol denudé et foyer d'érosion"},{"$f":"SUMPRODUCT(('Saisie des données'!$B$9:$B$208=B$5)*('Saisie des données'!$S$9:$S$208))","v":0},"/",{"$f":"IF($Q$11>0,B8/$Q$11,0)","v":0},{"$f":"SUMPRODUCT(('Saisie des données'!$B$9:$B$208=E$5)*('Saisie des données'!$S$9:$S$208))","v":0},"/",{"$f":"IF($Q$11>0,E8/$Q$11,0)","v":0},{"$f":"SUMPRODUCT(('Saisie des données'!$B$9:$B$208=H$5)*('Saisie des données'!$S$9:$S$208))","v":0},"/",{"$f":"IF($Q$11>0,H8/$Q$11,0)","v":0},{"$f":"SUMPRODUCT(('Saisie des données'!$B$9:$B$208=K$5)*('Saisie des données'!$S$9:$S$208))","v":0},"/",{"$f":"IF($Q$11>0,K8/$Q$11,0)","v":0},{"$f":"SUMPRODUCT(('Saisie des données'!$B$9:$B$208=N$5)*('Saisie des données'!$S$9:$S$208))","v":0},"/",{"$f":"IF($Q$11>0,N8/$Q$11,0)","v":0},{"$f":"B8+E8+H8+K8+N8","v":0},"/",{"$f":"D8+G8+J8+M8+P8","v":0}]
{"$rows_left_out":4}
{"sheet":"Classes de dégradation","index":7,"n_rows":12,"n_cols":5,"rows_kept":12,"cut":false,"hidden":true,"merged":[[0,0,0,5],[1,0,1,5]]}
[{"$f":"\"Tableau 5. \" & Options!C54","v":"Tableau 5. Importance des classes de dégradation du rivage"}]
[{"$f":"Options!C55","v":""}]
[]
["Classe",null,"Nombre de zones homogènes","Longueur de rive (m)","Importance relative (%)"]
[]
[{"$f":"Options!C57","v":"A (80% et plus du rivage non perturbé)"},null,{"$f":"COUNTIF('Saisie des données'!$V$9:$V$208,\">=0,8\")","v":0},{"$f":"SUMPRODUCT(('Saisie des données'!$V$9:$V$208>=80%)*('Saisie des données'!$C$9:$C$208))","v":0},{"$f":"IF($D$12>0,D6/$D$12,0)","v":0}]
[{"$f":"Options!C58","v":"B (60% à <80% du rivage non perturbé)"},null,{"$f":"COUNTIF('Saisie des données'!$V$9:$V$208,\">=0,6\")-COUNTIF('Saisie des données'!$V$9:$V$208,\">=0,8\")","v":0},{"$f":"SUMPRODUCT(('Saisie des données'!$V$9:$V$208>=60%)*('Saisie des données'!$V$9:$V$208<80%)*('Saisie des données'!$C$9:$C$208))","v":0},{"$f":"IF($D$12>0,D7/$D$12,0)","v":0}]
[{"$f":"Options!C59","v":"C (40% à <60% du rivage non perturbé)"},null,{"$f":"COUNTIF('Saisie des données'!$V$9:$V$208,\">=0,4\")-COUNTIF('Saisie des données'!$V$9:$V$208,\">=0,6\")","v":0},{"$f":"SUMPRODUCT(('Saisie des données'!$V$9:$V$208>=40%)*('Saisie des données'!$V$9:$V$208<60%)*('Saisie des données'!$C$9:$C$208))","v":0},{"$f":"IF($D$12>0,D8/$D$12,0)","v":0}]
{"$rows_left_out":5}
{"sheet":"Options","index":8,"n_rows":81,"n_cols":8,"rows_kept":81,"cut":false,"hidden":false,"merged":[[71,0,78,0],[71,1,72,1],[74,1,75,1],[71,2,72,2],[74,2,75,2],[80,1,81,1],[80,2,81,2],[77,1,78,1],[77,2,78,2],[0,6,0,7]]}
["Feuille","Champs ou cellules affectées","Valeur",null,null,null,"Choix de motifs pour graphiques"]
["Saisie des données","P1 P2 P3 P4 P5","Naturelle",null,null,null,"msoPattern5Percent",1]
[null,null,"Habitée",null,null,null,"msoPattern10Percent",2]
[null,null,"Infrastructures",null,null,null,"msoPattern20Percent",3]
[null,null,"Agriculture",null,null,null,"msoPattern25Percent",4]
[null,null,"Foresterie",null,null,null,"msoPattern30Percent",5]
[null,null,"Total",null,null,null,"msoPattern40Percent",6]
[null,null,null,null,null,null,"msoPattern50Percent",7]
{"$rows_left_out":74}
{"sheet":"Log","index":9,"n_rows":17,"n_cols":2,"rows_kept":17,"cut":false,"hidden":false,"merged":[[0,0,0,1]]}
["Journal des modifications apportées à l'outil"]
[]
["Date","Commentaires"]
["Aut. 2009","Codage de la macro CTRL-G. Cette macro ouvre une nouvelle feuille Excel et y copie tous les graphiques, lesquelles ne sont pas protégés et donc éditables."]
[null,"Possibilité de problèmes de compatibilité avec les version postérieures à Excel 2002. Un message d'avertissement va s'afficher à l'ouverture du fichier pour les"]
[null,"utilisateurs concernés seulement."]
["2010-01-28","Dans \"Saisie des données\" le nombre de zones homogènes possibles a été augmenté de 50 à 200."]
["2010-02-02","Dans \"Saisie des données\", colonne B, le code de la liste déroulante a été revu pour mieux gérer les choix possibles. Logique complexe. Je pense que c'est correct…"]
{"$rows_left_out":10}
{"sheet":"4GIS","index":10,"n_rows":201,"n_cols":9,"rows_kept":201,"cut":false,"hidden":true,"merged":[]}
["NoRsv","Zone","CatUtil","Longueur","LatDeb","LongDeb","LatFin","LongFin","Autres infos à ajouter"]
["=Identification!$C$10",{"$f":"'Saisie des données'!A9","v":1},{"$f":"'Saisie des données'!B9","v":0},{"$f":"'Saisie des données'!C9","v":0},{"$f":"'Saisie des données'!D9","v":0},{"$f":"'Saisie des données'!E9","v":0},{"$f":"'Saisie des données'!D10","v":0},{"$f":"'Saisie des données'!E10","v":0}]
["=Identification!$C$10",{"$f":"'Saisie des données'!A10","v":2},{"$f":"'Saisie des données'!B10","v":0},{"$f":"'Saisie des données'!C10","v":0},{"$f":"'Saisie des données'!D10","v":0},{"$f":"'Saisie des données'!E10","v":0},{"$f":"'Saisie des données'!D11","v":0},{"$f":"'Saisie des données'!E11","v":0}]
["=Identification!$C$10",{"$f":"'Saisie des données'!A11","v":3},{"$f":"'Saisie des données'!B11","v":0},{"$f":"'Saisie des données'!C11","v":0},{"$f":"'Saisie des données'!D11","v":0},{"$f":"'Saisie des données'!E11","v":0},{"$f":"'Saisie des données'!D12","v":0},{"$f":"'Saisie des données'!E12","v":0}]
["=Identification!$C$10",{"$f":"'Saisie des données'!A12","v":4},{"$f":"'Saisie des données'!B12","v":0},{"$f":"'Saisie des données'!C12","v":0},{"$f":"'Saisie des données'!D12","v":0},{"$f":"'Saisie des données'!E12","v":0},{"$f":"'Saisie des données'!D13","v":0},{"$f":"'Saisie des données'!E13","v":0}]
["=Identification!$C$10",{"$f":"'Saisie des données'!A13","v":5},{"$f":"'Saisie des données'!B13","v":0},{"$f":"'Saisie des données'!C13","v":0},{"$f":"'Saisie des données'!D13","v":0},{"$f":"'Saisie des données'!E13","v":0},{"$f":"'Saisie des données'!D14","v":0},{"$f":"'Saisie des données'!E14","v":0}]
["=Identification!$C$10",{"$f":"'Saisie des données'!A14","v":6},{"$f":"'Saisie des données'!B14","v":0},{"$f":"'Saisie des données'!C14","v":0},{"$f":"'Saisie des données'!D14","v":0},{"$f":"'Saisie des données'!E14","v":0},{"$f":"'Saisie des données'!D15","v":0},{"$f":"'Saisie des données'!E15","v":0}]
["=Identification!$C$10",{"$f":"'Saisie des données'!A15","v":7},{"$f":"'Saisie des données'!B15","v":0},{"$f":"'Saisie des données'!C15","v":0},{"$f":"'Saisie des données'!D15","v":0},{"$f":"'Saisie des données'!E15","v":0},{"$f":"'Saisie des données'!D16","v":0},{"$f":"'Saisie des données'!E16","v":0}]
{"$rows_left_out":193}